Reaction Details
Target5-hydroxytryptamine receptor 1A
LigandBDBM50131925
Substrate/Competitorn/a
Meas. Tech.ChEMBL_558363 (CHEMBL954165)
Ki>10000±n/a nM
Citation Butini, SGemma, SCampiani, GFranceschini, STrotta, FBorriello, MCeres, NRos, SCoccone, SSBernetti, MDe Angelis, MBrindisi, MNacci, VFiorini, INovellino, ECagnotto, AMennini, TSandager-Nielsen, KAndreasen, JTScheel-Kruger, JMikkelsen, JDFattorusso, C Discovery of a new class of potential multifunctional atypical antipsychotic agents targeting dopamine D3 and serotonin 5-HT1A and 5-HT2A receptors: design, synthesis, and effects on behavior. J Med Chem52:151-69 (2009) 
 
5-hydroxytryptamine receptor 1A
Name:5-hydroxytryptamine receptor 1A
Type:G Protein-Coupled Receptor (GPCR)
Mol. Mass.:46445.29
Organism:Rattus norvegicus (rat)
Description:Binding assays were performed using rat hippocampal membranes.
Residue:422
BDBM50131925
NameBDBM50131925
Synonyms:1H-Indole-2-carboxylic acid {4-[4-(2,4-dichloro-phenyl)-piperazin-1-yl]-butyl}-amide N-(4-(4-(2,4-dichlorophenyl)piperazin-1-yl)butyl)-1H-indole-2-carboxamide
TypeSmall organic molecule
Emp. Form.C23H26Cl2N4O
Mol. Mass.445.385
SMILESClc1ccc(N2CCN(CCCCNC(=O)c3cc4ccccc4[nH]3)CC2)c(Cl)c1