Reaction Details
TargetIntegrin alpha-IIb
LigandBDBM50277111
Substrate/Competitorn/a
Meas. Tech.ChEMBL_540409 (CHEMBL1029026)
IC50 167±n/a nM
Citation Letourneau, JJLiu, JOhlmeyer, MHRiviello, CRong, YLi, HAppell, KCBansal, SJacob, BWong, AWebb, ML Synthesis and initial evaluation of novel, non-peptidic antagonists of the alpha(v)-integrins alpha(v)beta(3) and alpha(v)beta(5). Bioorg Med Chem Lett19:352-5 (2008) 
 
Integrin alpha-IIb
Name:Integrin alpha-IIb
Type:Protein
Mol. Mass.:113354.85
Organism:Homo sapiens (Human)
Description:P08514
Residue:1039
BDBM50277111
NameBDBM50277111
Synonyms:3-Benzo[1,3]dioxol-5-yl-3-[1-oxo-6-(1,2,3,4-tetrahydro-benzo[4,5]imidazo[1,2-a]pyrimidin-9-yloxy)-3,4-dihydro-1H-isoquinolin-2-yl]-propionic acid | CHEMBL471675
TypeSmall organic molecule
Emp. Form.C29H26N4O6
Mol. Mass.526.5399
SMILESOC(=O)CC(N1CCc2cc(Oc3cccc4n5CCCNc5nc34)ccc2C1=O)c1ccc2OCOc2c1