Reaction Details
TargetProstaglandin G/H synthase 2
LigandBDBM50279625
Substrate/Competitorn/a
Meas. Tech.ChEMBL_545260 (CHEMBL1020706)
IC50 2000±n/a nM
Citation Dündar, YUnlü, SBanoqlu, EEntrena, ACostantino, GNuñez, MTLedo, FSahin, MFNoyanalpan, N Synthesis and biological evaluation of 4,5-diphenyloxazolone derivatives on route towards selective COX-2 inhibitors. Eur J Med Chem44:1830-7 (2009) 
 
Prostaglandin G/H synthase 2
Name:Prostaglandin G/H synthase 2
Type:Protein
Mol. Mass.:68976.98
Organism:Ovis aries (Sheep)
Description:n/a
Residue:603
BDBM50279625
NameBDBM50279625
Synonyms:4-(4-Phenyl-3-methyl-2-oxo-3H-1,3-oxazol-5-yl)benzensulfonamide | CHEMBL484814
TypeSmall organic molecule
Emp. Form.C16H14N2O4S
Mol. Mass.330.358
SMILESCn1c(c(oc1=O)-c1ccc(cc1)S(N)(=O)=O)-c1ccccc1