Reaction Details
TargetRAC-beta serine/threonine-protein kinase
LigandBDBM50256718
Substrate/Competitorn/a
Meas. Tech.ChEMBL_518710 (CHEMBL939832)
IC50 10±n/a nM
Citation Li, YLiang, JSiu, THu, ERossi, MABarnett, SFDefeo-Jones, DJones, RERobinson, RGLeander, KHuber, HEMittal, SCosford, NPrasit, P Allosteric inhibitors of Akt1 and Akt2: discovery of [1,2,4]triazolo[3,4-f][1,6]naphthyridines with potent and balanced activity. Bioorg Med Chem Lett19:834-6 (2009) 
 
RAC-beta serine/threonine-protein kinase
Name:RAC-beta serine/threonine-protein kinase
Type:Enzyme
Mol. Mass.:55766.64
Organism:Homo sapiens (Human)
Description:n/a
Residue:481
BDBM50256718
NameBDBM50256718
Synonyms:9-phenyl-8-(4-((4-(5-(pyridin-2-yl)-1H-1,2,4-triazol-3-yl)piperidin-1-yl)methyl)phenyl)-[1,2,4]triazolo[3,4-f][1,6]naphthyridine | CHEMBL447328
TypeSmall organic molecule
Emp. Form.C34H29N9
Mol. Mass.563.6544
SMILESC(N1CCC(CC1)c1nnc([nH]1)-c1ccccn1)c1ccc(cc1)-c1nc2ccn3cnnc3c2cc1-c1ccccc1