Reaction Details
TargetNeuronal acetylcholine receptor subunit alpha-4
LigandBDBM50256181
Substrate/Competitorn/a
Meas. Tech.ChEMBL_518972 (CHEMBL941560)
Ki 2700±n/a nM
Citation Pallavicini, MBolchi, CBinda, MCilia, AClementi, FFerrara, RFumagalli, LGotti, CMoretti, MPedretti, AVistoli, GValoti, E 5-(2-Pyrrolidinyl)oxazolidinones and 2-(2-pyrrolidinyl)benzodioxanes: synthesis of all the stereoisomers and alpha4beta2 nicotinic affinity. Bioorg Med Chem Lett19:854-9 (2009) 
 
Neuronal acetylcholine receptor subunit alpha-4
Name:Neuronal acetylcholine receptor subunit alpha-4
Type:Enzyme
Mol. Mass.:70196.44
Organism:Rattus norvegicus (Rat)
Description:P09483
Residue:630
BDBM50256181
NameBDBM50256181
Synonyms:(5S,2'S)-5-(1-methyl-2-pyrrolidinyl)oxazolidinone | CHEMBL500313
TypeSmall organic molecule
Emp. Form.C8H14N2O2
Mol. Mass.170.209
SMILESCN1CCC[C@H]1[C@@H]1CNC(=O)O1