Reaction Details
TargetNeuronal acetylcholine receptor subunit alpha-7
LigandBDBM50256181
Substrate/Competitorn/a
Meas. Tech.ChEMBL_518973 (CHEMBL941561)
Ki 21000±n/a nM
Citation Pallavicini, MBolchi, CBinda, MCilia, AClementi, FFerrara, RFumagalli, LGotti, CMoretti, MPedretti, AVistoli, GValoti, E 5-(2-Pyrrolidinyl)oxazolidinones and 2-(2-pyrrolidinyl)benzodioxanes: synthesis of all the stereoisomers and alpha4beta2 nicotinic affinity. Bioorg Med Chem Lett19:854-9 (2009) 
 
Neuronal acetylcholine receptor subunit alpha-7
Name:Neuronal acetylcholine receptor subunit alpha-7
Type:Enzyme
Mol. Mass.:56502.44
Organism:Rattus norvegicus (Rat)
Description:Q05941
Residue:502
BDBM50256181
NameBDBM50256181
Synonyms:(5S,2'S)-5-(1-methyl-2-pyrrolidinyl)oxazolidinone | CHEMBL500313
TypeSmall organic molecule
Emp. Form.C8H14N2O2
Mol. Mass.170.209
SMILESCN1CCC[C@H]1[C@@H]1CNC(=O)O1