Reaction Details
TargetProtein kinase C beta type
LigandBDBM50256734
Substrate/Competitorn/a
Meas. Tech.ChEMBL_519718 (CHEMBL938981)
IC50 350±n/a nM
Citation Furukawa, AArita, TSatoh, SAraki, KKuroha, MOhsumi, J (-)-Cercosporamide derivatives as novel antihyperglycemic agents. Bioorg Med Chem Lett19:724-6 (2009) 
 
Protein kinase C beta type
Name:Protein kinase C beta type
Type:Enzyme
Mol. Mass.:76873.67
Organism:Homo sapiens (Human)
Description:The recombinant human PKC enzymes were produced using a baculovirus expression system in SF9 cells
Residue:671
BDBM50256734
NameBDBM50256734
Synonyms:(-)-Cercosporamide | CHEMBL475816
TypeSmall organic molecule
Emp. Form.C16H13NO7
Mol. Mass.331.2769
SMILESCC(=O)C1C(=O)C=C2Oc3c(c(O)cc(O)c3C(N)=O)[C@]2(C)C1=O