Reaction Details
TargetHistone acetyltransferase KAT2B
LigandBDBM50247845
Substrate/Competitorn/a
Meas. Tech.ChEMBL_496186 (CHEMBL1001098)
IC50 2600±n/a nM
Citation Dekker, FJGhizzoni, Mvan der Meer, NWisastra, RHaisma, HJ Inhibition of the PCAF histone acetyl transferase and cell proliferation by isothiazolones. Bioorg Med Chem17:460-6 (2009) 
 
Histone acetyltransferase KAT2B
Name:Histone acetyltransferase KAT2B
Type:PROTEIN
Mol. Mass.:93045.76
Organism:Homo sapiens (Human)
Description:ChEMBL_1502838
Residue:832
BDBM50247845
NameBDBM50247845
Synonyms:Benzyl [2-(5-chloro-3-oxoisothiazol-2(3H)-yl)ethyl]carbamate | CHEMBL490684
TypeSmall organic molecule
Emp. Form.C13H13ClN2O3S
Mol. Mass.312.772
SMILESClc1cc(=O)n(CCNC(=O)OCc2ccccc2)s1