Reaction Details
TargetGastrin/cholecystokinin type B receptor
LigandBDBM50265493
Substrate/Competitorn/a
Meas. Tech.ChEMBL_559851 (CHEMBL1021532)
Ki 210±n/a nM
Citation Zheng, YAkgün, EHarikumar, KGHopson, JPowers, MDLunzer, MMMiller, LJPortoghese, PS Induced association of mu opioid (MOP) and type 2 cholecystokinin (CCK2) receptors by novel bivalent ligands. J Med Chem52:247-58 (2009) 
 
Gastrin/cholecystokinin type B receptor
Name:Gastrin/cholecystokinin type B receptor
Type:G Protein-Coupled Receptor (GPCR)
Mol. Mass.:48445.79
Organism:Homo sapiens (Human)
Description:Stable expression of human CCK-2 receptors in HEK 293 cells.
Residue:447
BDBM50265493
NameBDBM50265493
Synonyms:CHEMBL442943 | N-{m-[R(+)-1]Ureaphenoxy}ethyl-N'-oxymorphyldiglycoldiamide
TypeSmall organic molecule
Emp. Form.C46H49N7O9
Mol. Mass.843.9228
SMILESCN1CC[C@]23[C@H]4Oc5cc(O)cc(C[C@@H]1[C@]2(O)CC[C@@H]4NC(=O)COCC(=O)NCCOc1cccc(NC(=O)N[C@@H]2N=C(c4ccccc4)c4ccccc4N(C)C2=O)c1)c35