Reaction Details
TargetGastrin/cholecystokinin type B receptor
LigandBDBM50265492
Substrate/Competitorn/a
Meas. Tech.ChEMBL_559853 (CHEMBL1021534)
Ki 16.3±n/a nM
Citation Zheng, YAkgün, EHarikumar, KGHopson, JPowers, MDLunzer, MMMiller, LJPortoghese, PS Induced association of mu opioid (MOP) and type 2 cholecystokinin (CCK2) receptors by novel bivalent ligands. J Med Chem52:247-58 (2009) 
 
Gastrin/cholecystokinin type B receptor
Name:Gastrin/cholecystokinin type B receptor
Type:G Protein-Coupled Receptor (GPCR)
Mol. Mass.:48445.79
Organism:Homo sapiens (Human)
Description:Stable expression of human CCK-2 receptors in HEK 293 cells.
Residue:447
BDBM50265492
NameBDBM50265492
Synonyms:1-{1-Diglycoldiamide-6-[m-(R(+)-1)ureaphenoxy]ethane}-2-(N-oxymorphyldiglycoldiamide)hexane | CHEMBL502398
TypeSmall organic molecule
Emp. Form.C56H67N9O12
Mol. Mass.1058.1843
SMILESCN1CC[C@]23[C@H]4Oc5cc(O)cc(C[C@@H]1[C@]2(O)CC[C@@H]4NC(=O)COCC(=O)NCCCCCCNC(=O)COCC(=O)NCCOc1cccc(NC(=O)N[C@@H]2N=C(c4ccccc4)c4ccccc4N(C)C2=O)c1)c35