Reaction Details
TargetHistone deacetylase 1
LigandBDBM50255099
Substrate/Competitorn/a
Meas. Tech.ChEMBL_515326 (CHEMBL1035661)
IC50 180±n/a nM
Citation Raeppel, SZhou, NGaudette, FLeit, SPaquin, ILarouche, GMoradei, OFréchette, SIsakovic, LDelorme, DFournel, MKalita, ALu, ATrachy-Bourget, MCYan, PTLiu, JRahil, JWang, JBesterman, JMMurakami, KLi, ZVaisburg, A SAR and biological evaluation of analogues of a small molecule histone deacetylase inhibitor N-(2-aminophenyl)-4-((4-(pyridin-3-yl)pyrimidin-2-ylamino)methyl)benzamide (MGCD0103). Bioorg Med Chem Lett19:644-9 (2009) 
 
Histone deacetylase 1
Name:Histone deacetylase 1
Type:Enzyme
Mol. Mass.:55090.27
Organism:Homo sapiens (Human)
Description:Q13547
Residue:482
BDBM50255099
NameBDBM50255099
Synonyms:4-((2,3'-bipyridin-6-ylamino)methyl)-N-(2-aminophenyl)benzamide | CHEMBL481996
TypeSmall organic molecule
Emp. Form.C24H21N5O
Mol. Mass.395.4564
SMILESNc1ccccc1NC(=O)c1ccc(CNc2cccc(n2)-c2cccnc2)cc1