Reaction Details
TargetHistone deacetylase 1
LigandBDBM50255323
Substrate/Competitorn/a
Meas. Tech.ChEMBL_515326 (CHEMBL1035661)
IC50 230±n/a nM
Citation Raeppel, SZhou, NGaudette, FLeit, SPaquin, ILarouche, GMoradei, OFréchette, SIsakovic, LDelorme, DFournel, MKalita, ALu, ATrachy-Bourget, MCYan, PTLiu, JRahil, JWang, JBesterman, JMMurakami, KLi, ZVaisburg, A SAR and biological evaluation of analogues of a small molecule histone deacetylase inhibitor N-(2-aminophenyl)-4-((4-(pyridin-3-yl)pyrimidin-2-ylamino)methyl)benzamide (MGCD0103). Bioorg Med Chem Lett19:644-9 (2009) 
 
Histone deacetylase 1
Name:Histone deacetylase 1
Type:Enzyme
Mol. Mass.:55090.27
Organism:Homo sapiens (Human)
Description:Q13547
Residue:482
BDBM50255323
NameBDBM50255323
Synonyms:CHEMBL481988 | N-(2-aminophenyl)-4-((4-(6-(2-hydroxypropan-2-yl)pyridin-3-yl)pyrimidin-2-ylamino)methyl)benzamide
TypeSmall organic molecule
Emp. Form.C26H26N6O2
Mol. Mass.454.5236
SMILESCC(C)(O)c1ccc(cn1)-c1ccnc(NCc2ccc(cc2)C(=O)Nc2ccccc2N)n1