Reaction Details
TargetTransient receptor potential cation channel subfamily V member 1
LigandBDBM50255380
Substrate/Competitorn/a
Meas. Tech.ChEMBL_515379 (CHEMBL1025534)
IC50 9.4±n/a nM
Citation Xiao, DPalani, AAslanian, RMcKittrick, BAMcPhail, ATCorrell, CCPhelps, PTAnthes, JCRindgen, D Spiro-piperidine azetidinones as potent TRPV1 antagonists. Bioorg Med Chem Lett19:783-7 (2009) 
 
Transient receptor potential cation channel subfamily V member 1
Name:Transient receptor potential cation channel subfamily V member 1
Type:Protein
Mol. Mass.:94960.75
Organism:Homo sapiens (Human)
Description:Q8NER1
Residue:839
BDBM50255380
NameBDBM50255380
Synonyms:(S)-N-(4-tert-butylphenyl)-1-oxo-2,3-diphenyl-2,7-diazaspiro[3.5]nonane-7-carboxamide | CHEMBL479645
TypeSmall organic molecule
Emp. Form.C30H33N3O2
Mol. Mass.467.6019
SMILESCC(C)(C)c1ccc(NC(=O)N2CCC3(CC2)[C@@H](N(C3=O)c2ccccc2)c2ccccc2)cc1