Reaction Details
TargetPoly [ADP-ribose] polymerase 1
LigandBDBM27503
Substrate/Competitorn/a
Meas. Tech.ChEMBL_515430 (CHEMBL1028889)
IC50 1800±n/a nM
Citation Lord, AMMahon, MFLloyd, MDThreadgill, MD Design, synthesis, and evaluation in vitro of quinoline-8-carboxamides, a new class of poly(adenosine-diphosphate-ribose)polymerase-1 (PARP-1) inhibitor. J Med Chem52:868-77 (2009) 
 
Poly [ADP-ribose] polymerase 1
Name:Poly [ADP-ribose] polymerase 1
Type:n/a
Mol. Mass.:113114.22
Organism:Homo sapiens (Human)
Description:P09874
Residue:1014
BDBM27503
NameBDBM27503
Synonyms:5-AIQ 5-aminoisoquinolin-1(2H)-one | CHEMBL446240
TypeSmall organic molecule
Emp. Form.C9H8N2O
Mol. Mass.160.1726
SMILESNc1cccc2c1cc[nH]c2=O