Reaction Details
TargetLanosterol synthase
LigandBDBM50128070
Substrate/Competitorn/a
Meas. Tech.ChEMBL_515552 (CHEMBL1036573)
IC50 250±n/a nM
Citation Balliano, GDehmlow, HOliaro-Bosso, SScaldaferri, MTaramino, SViola, FCaron, GAebi, JAckermann, J Oxidosqualene cyclase from Saccharomyces cerevisiae, Trypanosoma cruzi, Pneumocystis carinii and Arabidopsis thaliana expressed in yeast: a model for the development of novel antiparasitic agents. Bioorg Med Chem Lett19:718-23 (2009) 
 
Lanosterol synthase
Name:Lanosterol synthase
Type:PROTEIN
Mol. Mass.:83309.32
Organism:Homo sapiens (Human)
Description:ChEMBL_11231
Residue:732
BDBM50128070
NameBDBM50128070
Synonyms:(4''-{[ALLYL(METHYL)AMINO]METHYL}-1,1''-BIPHENYL-4-YL)(4-BROMOPHENYL)METHANONE CHEMBL65230 | {4'-[(Allyl-methyl-amino)-methyl]-biphenyl-4-yl}-(4-bromo-phenyl)-methanone
TypeSmall organic molecule
Emp. Form.C24H22BrNO
Mol. Mass.420.342
SMILESCN(CC=C)Cc1ccc(cc1)-c1ccc(cc1)C(=O)c1ccc(Br)cc1