Reaction Details
TargetCycloartenol synthase
LigandBDBM50128065
Substrate/Competitorn/a
Meas. Tech.ChEMBL_515551 (CHEMBL1036572)
IC50 1750±n/a nM
Citation Balliano, GDehmlow, HOliaro-Bosso, SScaldaferri, MTaramino, SViola, FCaron, GAebi, JAckermann, J Oxidosqualene cyclase from Saccharomyces cerevisiae, Trypanosoma cruzi, Pneumocystis carinii and Arabidopsis thaliana expressed in yeast: a model for the development of novel antiparasitic agents. Bioorg Med Chem Lett19:718-23 (2009) 
 
Cycloartenol synthase
Name:Cycloartenol synthase
Type:PROTEIN
Mol. Mass.:86025.20
Organism:Arabidopsis thaliana
Description:ChEMBL_956102
Residue:759
BDBM50128065
NameBDBM50128065
Synonyms:CHEMBL304858 N-allyl-6-(4-(4-bromobenzoyl)-3-fluorophenoxy)-N-methylhexan-1-aminium {4-[6-(Allyl-methyl-amino)-hexyloxy]-2-fluoro-phenyl}-(4-bromo-phenyl)-methanone
TypeSmall organic molecule
Emp. Form.C23H27BrFNO2
Mol. Mass.448.368
SMILESCN(CCCCCCOc1ccc(C(=O)c2ccc(Br)cc2)c(F)c1)CC=C