Reaction Details
TargetCycloartenol synthase
LigandBDBM50128056
Substrate/Competitorn/a
Meas. Tech.ChEMBL_515551 (CHEMBL1036572)
IC50 3000±n/a nM
Citation Balliano, GDehmlow, HOliaro-Bosso, SScaldaferri, MTaramino, SViola, FCaron, GAebi, JAckermann, J Oxidosqualene cyclase from Saccharomyces cerevisiae, Trypanosoma cruzi, Pneumocystis carinii and Arabidopsis thaliana expressed in yeast: a model for the development of novel antiparasitic agents. Bioorg Med Chem Lett19:718-23 (2009) 
 
Cycloartenol synthase
Name:Cycloartenol synthase
Type:PROTEIN
Mol. Mass.:86025.20
Organism:Arabidopsis thaliana
Description:ChEMBL_956102
Residue:759
BDBM50128056
NameBDBM50128056
Synonyms:(E)-N-allyl-4-(3-(4-bromophenyl)benzofuran-6-yloxy)-N-methylbut-2-en-1-aminium CHEMBL481811 N-allyl-4-(3-(4-bromophenyl)benzofuran-6-yloxy)-N-methylbut-2-en-1-aminium
TypeSmall organic molecule
Emp. Form.C22H22BrNO2
Mol. Mass.412.32
SMILESCN(CC=C)C\C=C\COc1ccc2c(coc2c1)-c1ccc(Br)cc1