Reaction Details
TargetCycloartenol synthase
LigandBDBM50255601
Substrate/Competitorn/a
Meas. Tech.ChEMBL_515551 (CHEMBL1036572)
IC50 4100±n/a nM
Citation Balliano, GDehmlow, HOliaro-Bosso, SScaldaferri, MTaramino, SViola, FCaron, GAebi, JAckermann, J Oxidosqualene cyclase from Saccharomyces cerevisiae, Trypanosoma cruzi, Pneumocystis carinii and Arabidopsis thaliana expressed in yeast: a model for the development of novel antiparasitic agents. Bioorg Med Chem Lett19:718-23 (2009) 
 
Cycloartenol synthase
Name:Cycloartenol synthase
Type:PROTEIN
Mol. Mass.:86025.20
Organism:Arabidopsis thaliana
Description:ChEMBL_956102
Residue:759
BDBM50255601
NameBDBM50255601
Synonyms:CHEMBL481209 | N-(4-(5-(diethylamino)-5-methylhexyl)cyclohexyl)-N-methyl-4-(trifluoromethyl)benzenesulfonamide
TypeSmall organic molecule
Emp. Form.C25H41F3N2O2S
Mol. Mass.490.665
SMILESCCN(CC)C(C)(C)CCCC[C@H]1CC[C@@H](CC1)N(C)S(=O)(=O)c1ccc(cc1)C(F)(F)F