Reaction Details
TargetTranslocator protein
LigandBDBM50122293
Substrate/Competitorn/a
Meas. Tech.ChEMBL_515651 (CHEMBL1029743)
Ki 0.242000±n/a nM
Citation Briard, EZoghbi, SSSiméon, FGImaizumi, MGourley, JPShetty, HULu, SFujita, MInnis, RBPike, VW Single-step high-yield radiosynthesis and evaluation of a sensitive 18F-labeled ligand for imaging brain peripheral benzodiazepine receptors with PET. J Med Chem52:688-99 (2009) 
 
Translocator protein
Name:Translocator protein
Type:Enzyme
Mol. Mass.:18834.74
Organism:Homo sapiens (Human)
Description:P30536
Residue:169
BDBM50122293
NameBDBM50122293
Synonyms:CHEMBL401000 N-(2,5-Dimethoxy-benzyl)-N-(5-fluoro-2-phenoxy-phenyl)-acetamide N-(2,5-dimethoxybenzyl)-N-(5-fluoro-2-phenoxyphenyl)acetamide
TypeSmall organic molecule
Emp. Form.C23H22FNO4
Mol. Mass.395.4235
SMILESCOc1ccc(OC)c(CN(C(C)=O)c2cc(F)ccc2Oc2ccccc2)c1