Reaction Details
TargetProstaglandin E2 receptor EP3 subtype
LigandBDBM50255778
Substrate/Competitorn/a
Meas. Tech.ChEMBL_515731 (CHEMBL1023733)
IC50 1.7±n/a nM
Citation O'Connell, MZeller, WBurgeson, JMishra, RKRamirez, JKiselyov, ASAndrésson, TGurney, MESingh, J Peri-substituted hexahydro-indolones as novel, potent and selective human EP3 receptor antagonists. Bioorg Med Chem Lett19:778-82 (2009) 
 
Prostaglandin E2 receptor EP3 subtype
Name:Prostaglandin E2 receptor EP3 subtype
Type:Enzyme
Mol. Mass.:43335.03
Organism:Homo sapiens (Human)
Description:P43115
Residue:390
BDBM50255778
NameBDBM50255778
Synonyms:3-(1-(2,3-dichlorobenzyl)-3a-methyl-2-oxo-2,3,3a,4,5,6-hexahydro-1H-indol-7-yl)-N-(4,5-dichlorothiophen-2-ylsulfonyl)acrylamide | CHEMBL516765
TypeSmall organic molecule
Emp. Form.C23H20Cl4N2O4S2
Mol. Mass.594.358
SMILESCC12CC(=O)N(Cc3cccc(Cl)c3Cl)C1=C(CCC2)\C=C\C(=O)NS(=O)(=O)c1cc(Cl)c(Cl)s1