Reaction Details
TargetPoly [ADP-ribose] polymerase 1
LigandBDBM50255572
Substrate/Competitorn/a
Meas. Tech.ChEMBL_515852 (CHEMBL993111)
IC50 45±n/a nM
Citation Zhang, WTRuan, JLWu, PFJiang, FCZhang, LNFang, WChen, XLWang, YCao, BSChen, GYZhu, YJGu, JChen, JG Design, synthesis, and cytoprotective effect of 2-aminothiazole analogues as potent poly(ADP-ribose) polymerase-1 inhibitors. J Med Chem52:718-25 (2009) 
 
Poly [ADP-ribose] polymerase 1
Name:Poly [ADP-ribose] polymerase 1
Type:n/a
Mol. Mass.:113114.22
Organism:Homo sapiens (Human)
Description:P09874
Residue:1014
BDBM50255572
NameBDBM50255572
Synonyms:((2R,3S,4R,5R)-5-(6-amino-9H-purin-9-yl)-3,4-dihydroxytetrahydrofuran-2-yl)methyl 4-(2-oxo-2-(1-oxoisoindolin-4-ylamino)ethyl)piperazine-1-carboxylate | CHEMBL510733
TypeSmall organic molecule
Emp. Form.C25H29N9O7
Mol. Mass.567.5539
SMILESNc1ncnc2n(cnc12)[C@@H]1O[C@H](COC(=O)N2CCN(CC(=O)Nc3cccc4C(=O)NCc34)CC2)[C@@H](O)[C@H]1O