Reaction Details
TargetPoly [ADP-ribose] polymerase 1
LigandBDBM50255502
Substrate/Competitorn/a
Meas. Tech.ChEMBL_515852 (CHEMBL993111)
IC50 46±n/a nM
Citation Zhang, WTRuan, JLWu, PFJiang, FCZhang, LNFang, WChen, XLWang, YCao, BSChen, GYZhu, YJGu, JChen, JG Design, synthesis, and cytoprotective effect of 2-aminothiazole analogues as potent poly(ADP-ribose) polymerase-1 inhibitors. J Med Chem52:718-25 (2009) 
 
Poly [ADP-ribose] polymerase 1
Name:Poly [ADP-ribose] polymerase 1
Type:n/a
Mol. Mass.:113114.22
Organism:Homo sapiens (Human)
Description:P09874
Residue:1014
BDBM50255502
NameBDBM50255502
Synonyms:2-(2-(4-phenyl-5,6-dihydropyridin-1(2H)-yl)ethyl)phenanthridin-6(5H)-one | CHEMBL480234
TypeSmall organic molecule
Emp. Form.C26H24N2O
Mol. Mass.380.4816
SMILESO=c1[nH]c2ccc(CCN3CCC(=CC3)c3ccccc3)cc2c2ccccc12