Reaction Details
TargetAdenosine receptor A2a
LigandBDBM50266503
Substrate/Competitorn/a
Meas. Tech.ChEMBL_516361 (CHEMBL987748)
Ki 27±n/a nM
Citation Lanier, MCMoorjani, MLuo, ZChen, YLin, ETellew, JEZhang, XWilliams, JPGross, RSLechner, SMMarkison, SJoswig, TKargo, WPiercey, JSantos, MMalany, SZhao, MPetroski, RCrespo, MIDíaz, JLSaunders, JWen, JO'Brien, ZJalali, KMadan, ASlee, DH N-[6-amino-2-(heteroaryl)pyrimidin-4-yl]acetamides as A2A receptor antagonists with improved drug like properties and in vivo efficacy. J Med Chem52:709-17 (2009) 
 
Adenosine receptor A2a
Name:Adenosine receptor A2a
Type:G Protein-Coupled Receptor (GPCR)
Mol. Mass.:44716.46
Organism:Homo sapiens (Human)
Description:P29274
Residue:412
BDBM50266503
NameBDBM50266503
Synonyms:CHEMBL456068 | N-[6-((S)-2-Methoxymethylpyrrolidin-1-yl)-2-thiophen-2-yl-pyrimidin-4-yl]acetamide
TypeSmall organic molecule
Emp. Form.C16H20N4O2S
Mol. Mass.332.421
SMILESCOC[C@@H]1CCCN1c1cc(NC(C)=O)nc(n1)-c1cccs1