Reaction Details
TargetKynureninase
LigandBDBM50265459
Substrate/Competitorn/a
Meas. Tech.ChEMBL_560668 (CHEMBL1009940)
Ki 60000±n/a nM
Citation Lima, SKumar, SGawandi, VMomany, CPhillips, RS Crystal structure of the Homo sapiens kynureninase-3-hydroxyhippuric acid inhibitor complex: insights into the molecular basis of kynureninase substrate specificity. J Med Chem52:389-96 (2009) 
 
Kynureninase
Name:Kynureninase
Type:PROTEIN
Mol. Mass.:52356.52
Organism:Homo sapiens (Human)
Description:ChEMBL_91729
Residue:465
BDBM50265459
NameBDBM50265459
Synonyms:3-Hydroxyhippuric acid | CHEMBL447627
TypeSmall organic molecule
Emp. Form.C9H9NO4
Mol. Mass.195.1721
SMILESOC(=O)CNC(=O)c1cccc(O)c1