Reaction Details
TargetMu-type opioid receptor
LigandBDBM50216132
Substrate/Competitorn/a
Meas. Tech.ChEMBL_517099 (CHEMBL988704)
Ki>1000±n/a nM
Citation Béguin, CDuncan, KKMunro, TAHo, DMXu, WLiu-Chen, LYCarlezon, WACohen, BM Modification of the furan ring of salvinorin A: identification of a selective partial agonist at the kappa opioid receptor. Bioorg Med Chem17:1370-80 (2009) 
 
Mu-type opioid receptor
Name:Mu-type opioid receptor
Type:G Protein-Coupled Receptor (GPCR)
Mol. Mass.:44503.11
Organism:Rattus norvegicus (rat)
Description:Competition binding assays were carried out using membrane preparations from transfected HN9.10 cells that constitutively expressed the mu opioid receptor.
Residue:398
BDBM50216132
NameBDBM50216132
Synonyms:(2S,4aR,6aR,7R,9S,10aS,10bR)-methyl 9-acetoxy-2-(2-bromofuran-3-yl)-6a,10b-dimethyl-4,10-dioxo-dodecahydro-1H-benzo[f]isochromene-7-carboxylate CHEMBL390935
TypeSmall organic molecule
Emp. Form.C23H27BrO8
Mol. Mass.511.36
SMILESCOC(=O)[C@@H]1C[C@H](OC(C)=O)C(=O)[C@H]2[C@@]1(C)CC[C@H]1C(=O)O[C@@H](C[C@]21C)c1ccoc1Br