Reaction Details
TargetKappa-type opioid receptor
LigandBDBM50266336
Substrate/Competitorn/a
Meas. Tech.ChEMBL_517096 (CHEMBL988701)
Ki 7.1±n/a nM
Citation Béguin, CDuncan, KKMunro, TAHo, DMXu, WLiu-Chen, LYCarlezon, WACohen, BM Modification of the furan ring of salvinorin A: identification of a selective partial agonist at the kappa opioid receptor. Bioorg Med Chem17:1370-80 (2009) 
 
Kappa-type opioid receptor
Name:Kappa-type opioid receptor
Type:G Protein-Coupled Receptor (GPCR)
Mol. Mass.:42648.76
Organism:Homo sapiens (Human)
Description:P41145
Residue:380
BDBM50266336
NameBDBM50266336
Synonyms:(2S,4aR,6aR,7R,9S,10aS,10bR)-methyl 9-acetoxy-6a,10b-dimethyl-4,10-dioxo-2-(2-vinylfuran-3-yl)dodecahydro-1H-benzo[f]isochromene-7-carboxylate | CHEMBL458234
TypeSmall organic molecule
Emp. Form.C25H30O8
Mol. Mass.458.5009
SMILESCOC(=O)[C@@H]1C[C@H](OC(C)=O)C(=O)[C@H]2[C@@]1(C)CC[C@H]1C(=O)O[C@@H](C[C@]21C)c1ccoc1C=C