Reaction Details
TargetSterol O-acyltransferase 1
LigandBDBM50276493
Substrate/Competitorn/a
Meas. Tech.ChEMBL_540911 (CHEMBL1027336)
IC50 32±n/a nM
Citation Asano, SBan, HKino, KIoriya, KMuraoka, M Novel 1,4-diarylpiperidine-4-methylureas as anti-hyperlipidemic agents: dual effectors on acyl-CoA:cholesterol O-acyltransferase and low-density lipoprotein receptor expression. Bioorg Med Chem Lett19:1062-5 (2009) 
 
Sterol O-acyltransferase 1
Name:Sterol O-acyltransferase 1
Type:Multi-pass membrane protein may form homo- or heterodimers.
Mol. Mass.:64751.94
Organism:Homo sapiens (Human)
Description:P35610
Residue:550
BDBM50276493
NameBDBM50276493
Synonyms:1-(4-amino-2,6-diisopropylphenyl)-3-((1-(2-methoxyphenyl)-4-(3-(trifluoromethyl)phenyl)piperidin-4-yl)methyl)urea | CHEMBL453491
TypeSmall organic molecule
Emp. Form.C33H41F3N4O2
Mol. Mass.582.6994
SMILESCOc1ccccc1N1CCC(CNC(=O)Nc2c(cc(N)cc2C(C)C)C(C)C)(CC1)c1cccc(c1)C(F)(F)F