Reaction Details
TargetCasein kinase II subunit alpha
LigandBDBM50156669
Substrate/Competitorn/a
Meas. Tech.ChEMBL_541049 (CHEMBL1024749)
IC50 1300±n/a nM
Citation Najda-Bernatowicz, AŁebska, MOrzeszko, AKopanska, KKrzywinska, EMuszynska, GBretner, M Synthesis of new analogs of benzotriazole, benzimidazole and phthalimide--potential inhibitors of human protein kinase CK2. Bioorg Med Chem17:1573-8 (2009) 
 
Casein kinase II subunit alpha
Name:Casein kinase II subunit alpha
Type:Enzyme
Mol. Mass.:45151.12
Organism:Homo sapiens (Human)
Description:P68400
Residue:391
BDBM50156669
NameBDBM50156669
Synonyms:4,5,6,7-TETRABROMO-BENZIMIDAZOLE 4,5,6,7-tetrabromo-1H-benzo[d]imidazole 4,5,6,7-tetrabromobenzimidazole | CHEMBL373937
TypeSmall organic molecule
Emp. Form.C7H2Br4N2
Mol. Mass.433.72
SMILESBrc1c(Br)c(Br)c2[nH]cnc2c1Br