Reaction Details
TargetC-X-C chemokine receptor type 1
LigandBDBM50248500
Substrate/Competitorn/a
Meas. Tech.ChEMBL_566225 (CHEMBL963306)
Ki 34±n/a nM
Citation Biju, PTaveras, AGDwyer, MPYu, YChao, JHipkin, RWFan, XRindgen, DFine, JLundell, D Fluoroalkyl alpha side chain containing 3,4-diamino-cyclobutenediones as potent and orally bioavailable CXCR2-CXCR1 dual antagonists. Bioorg Med Chem Lett19:1431-3 (2009) 
 
C-X-C chemokine receptor type 1
Name:C-X-C chemokine receptor type 1
Type:Enzyme
Mol. Mass.:39803.83
Organism:Homo sapiens (Human)
Description:P25024
Residue:350
BDBM50248500
NameBDBM50248500
Synonyms:(S)-3-(2-(1-(5-chlorofuran-2-yl)-2,2,2-trifluoroethylamino)-3,4-dioxocyclobut-1-enylamino)-2-hydroxy-N,N-dimethylbenzamide | CHEMBL491134
TypeSmall organic molecule
Emp. Form.C19H15ClF3N3O5
Mol. Mass.457.788
SMILESCN(C)C(=O)c1cccc(Nc2c(N[C@@H](c3ccc(Cl)o3)C(F)(F)F)c(=O)c2=O)c1O