Reaction Details
TargetC-X-C chemokine receptor type 1
LigandBDBM50248281
Substrate/Competitorn/a
Meas. Tech.ChEMBL_566225 (CHEMBL963306)
Ki 100±n/a nM
Citation Biju, PTaveras, AGDwyer, MPYu, YChao, JHipkin, RWFan, XRindgen, DFine, JLundell, D Fluoroalkyl alpha side chain containing 3,4-diamino-cyclobutenediones as potent and orally bioavailable CXCR2-CXCR1 dual antagonists. Bioorg Med Chem Lett19:1431-3 (2009) 
 
C-X-C chemokine receptor type 1
Name:C-X-C chemokine receptor type 1
Type:Enzyme
Mol. Mass.:39803.83
Organism:Homo sapiens (Human)
Description:P25024
Residue:350
BDBM50248281
NameBDBM50248281
Synonyms:(R)-3-(3,4-dioxo-2-(3,3,3-trifluoro-1-(furan-2-yl)propylamino)cyclobut-1-enylamino)-2-hydroxy-N,N-dimethylbenzamide | CHEMBL473145
TypeSmall organic molecule
Emp. Form.C20H18F3N3O5
Mol. Mass.437.3692
SMILESCN(C)C(=O)c1cccc(Nc2c(N[C@H](CC(F)(F)F)c3ccco3)c(=O)c2=O)c1O