Reaction Details
TargetC-X-C chemokine receptor type 1
LigandBDBM50248084
Substrate/Competitorn/a
Meas. Tech.ChEMBL_566227 (CHEMBL963308)
Ki 7.5±n/a nM
Citation Biju, PTaveras, AGYu, YZheng, JHipkin, RWFossetta, JFan, XFine, JLundell, D 3,4-Diamino-1,2,5-thiadiazole as potent and selective CXCR2 antagonists. Bioorg Med Chem Lett19:1434-7 (2009) 
 
C-X-C chemokine receptor type 1
Name:C-X-C chemokine receptor type 1
Type:Enzyme
Mol. Mass.:39803.83
Organism:Homo sapiens (Human)
Description:P25024
Residue:350
BDBM50248084
NameBDBM50248084
Synonyms:(R)-2-hydroxy-N,N-dimethyl-3-(4-(1-(5-methylfuran-2-yl)propylamino)-1,2,5-thiadiazol-3-ylamino)-6-(trifluoromethyl)benzamide | CHEMBL464013
TypeSmall organic molecule
Emp. Form.C20H22F3N5O3S
Mol. Mass.469.481
SMILESCC[C@@H](Nc1nsnc1Nc1ccc(c(C(=O)N(C)C)c1O)C(F)(F)F)c1ccc(C)o1