Reaction Details
TargetC-X-C chemokine receptor type 2
LigandBDBM50248546
Substrate/Competitorn/a
Meas. Tech.ChEMBL_566228 (CHEMBL963309)
Ki 10000±n/a nM
Citation Biju, PTaveras, AGYu, YZheng, JHipkin, RWFossetta, JFan, XFine, JLundell, D 3,4-Diamino-1,2,5-thiadiazole as potent and selective CXCR2 antagonists. Bioorg Med Chem Lett19:1434-7 (2009) 
 
C-X-C chemokine receptor type 2
Name:C-X-C chemokine receptor type 2
Type:Protein
Mol. Mass.:40767.88
Organism:Homo sapiens (Human)
Description:P25025
Residue:360
BDBM50248546
NameBDBM50248546
Synonyms:(S)-3-(4-(3,3-dimethylbutan-2-ylamino)-1,2,5-thiadiazol-3-ylamino)-2-hydroxy-N,N-dimethylbenzamide | CHEMBL464302
TypeSmall organic molecule
Emp. Form.C17H25N5O2S
Mol. Mass.363.478
SMILESC[C@H](Nc1nsnc1Nc1cccc(C(=O)N(C)C)c1O)C(C)(C)C