Reaction Details
TargetC-X-C chemokine receptor type 2
LigandBDBM50248115
Substrate/Competitorn/a
Meas. Tech.ChEMBL_566228 (CHEMBL963309)
Ki 44±n/a nM
Citation Biju, PTaveras, AGYu, YZheng, JHipkin, RWFossetta, JFan, XFine, JLundell, D 3,4-Diamino-1,2,5-thiadiazole as potent and selective CXCR2 antagonists. Bioorg Med Chem Lett19:1434-7 (2009) 
 
C-X-C chemokine receptor type 2
Name:C-X-C chemokine receptor type 2
Type:Protein
Mol. Mass.:40767.88
Organism:Homo sapiens (Human)
Description:P25025
Residue:360
BDBM50248115
NameBDBM50248115
Synonyms:(R)-N-(2-cyanoethyl)-3-(4-(1-(furan-2-yl)-2,2-dimethylpropylamino)-1,2,5-thiadiazol-3-ylamino)-2-hydroxy-N-methylbenzamide | CHEMBL462331
TypeSmall organic molecule
Emp. Form.C22H26N6O3S
Mol. Mass.454.545
SMILESCN(CCC#N)C(=O)c1cccc(Nc2nsnc2N[C@@H](c2ccco2)C(C)(C)C)c1O