Reaction Details
TargetHepatocyte growth factor receptor
LigandBDBM50248052
Substrate/Competitorn/a
Meas. Tech.ChEMBL_566634 (CHEMBL960948)
IC50 29±n/a nM
Citation Raeppel, SClaridge, SSaavedra, OGaudette, FZhan, LMannion, MZhou, NRaeppel, FGranger, MCIsakovic, LDéziel, RNguyen, HBeaulieu, NBeaulieu, CDupont, IRobert, MFLefebvre, SDubay, MRahil, JWang, JSte-Croix, HRobert Macleod, ABesterman, JVaisburg, A N-(3-fluoro-4-(2-arylthieno[3,2-b]pyridin-7-yloxy)phenyl)-2-oxo-3-phenylimidazolidine-1-carboxamides: a novel series of dual c-Met/VEGFR2 receptor tyrosine kinase inhibitors. Bioorg Med Chem Lett19:1323-8 (2009) 
 
Hepatocyte growth factor receptor
Name:Hepatocyte growth factor receptor
Type:Protein
Mol. Mass.:155559.73
Organism:Homo sapiens (Human)
Description:P08581
Residue:1390
BDBM50248052
NameBDBM50248052
Synonyms:CHEMBL447616 | N-(3-fluoro-4-(2-(4-((4-methylpiperazin-1-yl)methyl)phenyl)thieno[3,2-b]pyridin-7-yloxy)phenyl)-2-oxo-3-phenylimidazolidine-1-carboxamide
TypeSmall organic molecule
Emp. Form.C35H33FN6O3S
Mol. Mass.636.738
SMILESCN1CCN(Cc2ccc(cc2)-c2cc3nccc(Oc4ccc(NC(=O)N5CCN(C5=O)c5ccccc5)cc4F)c3s2)CC1