Reaction Details
TargetPotassium voltage-gated channel subfamily H member 2
LigandBDBM50257685
Substrate/Competitorn/a
Meas. Tech.ChEMBL_565970 (CHEMBL963244)
Ki 343±n/a nM
Citation Owen, DRRodriguez-Lens, MCorless, MDGaulier, SMHorne, VAKinloch, RAMaw, GNPearce, DWRees, HRinger, TJRyckmans, TStammen, BL 2,4-Diaminopyridine delta-opioid receptor agonists and their associated hERG pharmacology. Bioorg Med Chem Lett19:1702-6 (2009) 
 
Potassium voltage-gated channel subfamily H member 2
Name:Potassium voltage-gated channel subfamily H member 2
Type:Multi-pass membrane protein
Mol. Mass.:126672.65
Organism:Homo sapiens (Human)
Description:Q12809
Residue:1159
BDBM50257685
NameBDBM50257685
Synonyms:CHEMBL492330 | N-(1-(4-aminopyridin-2-yl)-4-phenylpiperidin-4-yl)-3-chloro-4-methoxybenzamide
TypeSmall organic molecule
Emp. Form.C24H25ClN4O2
Mol. Mass.436.934
SMILESCOc1ccc(cc1Cl)C(=O)NC1(CCN(CC1)c1cc(N)ccn1)c1ccccc1