Reaction Details
TargetPotassium voltage-gated channel subfamily H member 2
LigandBDBM50257723
Substrate/Competitorn/a
Meas. Tech.ChEMBL_565970 (CHEMBL963244)
Ki 18±n/a nM
Citation Owen, DRRodriguez-Lens, MCorless, MDGaulier, SMHorne, VAKinloch, RAMaw, GNPearce, DWRees, HRinger, TJRyckmans, TStammen, BL 2,4-Diaminopyridine delta-opioid receptor agonists and their associated hERG pharmacology. Bioorg Med Chem Lett19:1702-6 (2009) 
 
Potassium voltage-gated channel subfamily H member 2
Name:Potassium voltage-gated channel subfamily H member 2
Type:Multi-pass membrane protein
Mol. Mass.:126672.65
Organism:Homo sapiens (Human)
Description:Q12809
Residue:1159
BDBM50257723
NameBDBM50257723
Synonyms:2-(3-phenyl-3H-spiro[isobenzofuran-1,4'-piperidine]-1'-yl)pyridin-4-amine | CHEMBL492553
TypeSmall organic molecule
Emp. Form.C23H23N3O
Mol. Mass.357.4482
SMILESNc1ccnc(c1)N1CCC2(CC1)OC(c1ccccc21)c1ccccc1