Reaction Details
TargetGlucocorticoid receptor
LigandBDBM50276438
Substrate/Competitorn/a
Meas. Tech.ChEMBL_542867 (CHEMBL1022144)
IC50 2.3±n/a nM
Citation Robinson, RPBuckbinder, LHaugeto, AIMcNiff, PAMillham, MLReese, MRSchaefer, JFAbramov, YABordner, JChantigny, YAKleinman, EFLaird, ERMorgan, BPMurray, JCSalter, EDWessel, MDYocum, SA Octahydrophenanthrene-2,7-diol analogues as dissociated glucocorticoid receptor agonists: discovery and lead exploration. J Med Chem52:1731-43 (2009) 
 
Glucocorticoid receptor
Name:Glucocorticoid receptor
Type:Enzyme
Mol. Mass.:85656.87
Organism:Homo sapiens (Human)
Description:P04150
Residue:777
BDBM50276438
NameBDBM50276438
Synonyms:(2R,4aR,10aR)-4a-Ethyl-7-(2-methylpyridin-3-ylmethoxy)-2-prop-1-ynyl-1,2,3,4,4a,9,10,10a-octahydrophenanthren-2-ol | CHEMBL457036
TypeSmall organic molecule
Emp. Form.C26H31NO2
Mol. Mass.389.5298
SMILESCC[C@@]12CC[C@@](O)(C[C@H]1CCc1cc(OCc3cccnc3C)ccc21)C#CC