Reaction Details
TargetKappa-type opioid receptor
LigandBDBM50248825
Substrate/Competitorn/a
Meas. Tech.ChEMBL_543312 (CHEMBL1019449)
EC50 0.4±n/a nM
Citation Cami-Kobeci, GNeal, APBradbury, FAPurington, LCAceto, MDHarris, LSLewis, JWTraynor, JRHusbands, SM Mixed kappa/mu opioid receptor agonists: the 6 beta-naltrexamines. J Med Chem52:1546-52 (2009) 
 
Kappa-type opioid receptor
Name:Kappa-type opioid receptor
Type:G Protein-Coupled Receptor (GPCR)
Mol. Mass.:42648.76
Organism:Homo sapiens (Human)
Description:P41145
Residue:380
BDBM50248825
NameBDBM50248825
Synonyms:(2E)-3-(2-chlorophenyl)-N-[(1S,5R,13R,14R,17S)-4-(cyclopropylmethyl)-10,17-dihydroxy-12-oxa-4-azapentacyclo[9.6.1.0^{1,13}.0^{5,17}.0^{7,18}]octadeca-7(18),8,10-trien-14-yl]prop-2-enamide | CHEMBL511655
TypeSmall organic molecule
Emp. Form.C29H31ClN2O4
Mol. Mass.507.02
SMILESOc1ccc2C[C@H]3N(CC4CC4)CC[C@@]45[C@@H](Oc1c24)[C@@H](CC[C@@]35O)NC(=O)\C=C\c1ccccc1Cl