Reaction Details
TargetTyrosine-protein kinase SYK
LigandBDBM50249416
Substrate/Competitorn/a
Meas. Tech.ChEMBL_499518 (CHEMBL1022010)
IC50 110±n/a nM
Citation Xie, HZLi, LLRen, JXZou, JYang, LWei, YQYang, SY Pharmacophore modeling study based on known spleen tyrosine kinase inhibitors together with virtual screening for identifying novel inhibitors. Bioorg Med Chem Lett19:1944-9 (2009) 
 
Tyrosine-protein kinase SYK
Name:Tyrosine-protein kinase SYK
Type:Enzyme
Mol. Mass.:72079.99
Organism:Homo sapiens (Human)
Description:P43405
Residue:635
BDBM50249416
NameBDBM50249416
Synonyms:CHEMBL471776 | N-(3-methyl-5-(trifluoromethyl)phenyl)-4-(thiazol-2-yl)pyrimidin-2-amine
TypeSmall organic molecule
Emp. Form.C15H11F3N4S
Mol. Mass.336.335
SMILESCc1cc(Nc2nccc(n2)-c2nccs2)cc(c1)C(F)(F)F