Reaction Details
TargetTyrosine-protein kinase SYK
LigandBDBM50249539
Substrate/Competitorn/a
Meas. Tech.ChEMBL_499518 (CHEMBL1022010)
IC50 4±n/a nM
Citation Xie, HZLi, LLRen, JXZou, JYang, LWei, YQYang, SY Pharmacophore modeling study based on known spleen tyrosine kinase inhibitors together with virtual screening for identifying novel inhibitors. Bioorg Med Chem Lett19:1944-9 (2009) 
 
Tyrosine-protein kinase SYK
Name:Tyrosine-protein kinase SYK
Type:Enzyme
Mol. Mass.:72079.99
Organism:Homo sapiens (Human)
Description:P43405
Residue:635
BDBM50249539
NameBDBM50249539
Synonyms:5-((1S,2R)-2-aminocyclohexylamino)-7-(3,5-dimethoxyphenylamino)-[1,2,4]triazolo[1,5-c]pyrimidine-8-carboxamide CHEMBL475575 | cis-5-(2-Aminocyclohexylamino)-7-(3,5-dimethoxyphenylamino)-1,2,4-triazolo[1,5-c]pyrimidine-8-carboxamide
TypeSmall organic molecule
Emp. Form.C20H26N8O3
Mol. Mass.426.4722
SMILESCOc1cc(Nc2nc(N[C@H]3CCCC[C@H]3N)n3ncnc3c2C(N)=O)cc(OC)c1