Reaction Details
TargetTyrosine-protein kinase SYK
LigandBDBM50132439
Substrate/Competitorn/a
Meas. Tech.ChEMBL_499518 (CHEMBL1022010)
IC50 940±n/a nM
Citation Xie, HZLi, LLRen, JXZou, JYang, LWei, YQYang, SY Pharmacophore modeling study based on known spleen tyrosine kinase inhibitors together with virtual screening for identifying novel inhibitors. Bioorg Med Chem Lett19:1944-9 (2009) 
 
Tyrosine-protein kinase SYK
Name:Tyrosine-protein kinase SYK
Type:Enzyme
Mol. Mass.:72079.99
Organism:Homo sapiens (Human)
Description:P43405
Residue:635
BDBM50132439
NameBDBM50132439
Synonyms:3-[1-(5-Methoxy-1-methyl-1H-indol-3-yl)-meth-(Z)-ylidene]-2-oxo-2,3-dihydro-1H-indole-5-sulfonic acid isobutyl-amide N-isobutyl-3-((5-methoxy-1-methyl-1H-indol-3-yl)methylene)-2-oxoindoline-5-sulfonamide
TypeSmall organic molecule
Emp. Form.C23H25N3O4S
Mol. Mass.439.527
SMILESCOc1ccc2n(C)cc(\C=C3/C(=O)Nc4ccc(cc34)S(=O)(=O)NCC(C)C)c2c1