Reaction Details
TargetCholecystokinin receptor type A
LigandBDBM50278248
Substrate/Competitorn/a
Meas. Tech.ChEMBL_564593 (CHEMBL964033)
IC50 3150±n/a nM
Citation Lassiani, LPavan, MVBerti, FKokotos, GMarkidis, TMennuni, LMakovec, FVarnavas, A Anthranilic acid based CCK1 receptor antagonists: blocking the receptor with the same 'words' of the endogenous ligand. Bioorg Med Chem17:2336-50 (2009) 
 
Cholecystokinin receptor type A
Name:Cholecystokinin receptor type A
Type:Enzyme Catalytic Domain
Mol. Mass.:49676.37
Organism:RAT
Description:Cholecystokinin central 0 RAT::P30551
Residue:444
BDBM50278248
NameBDBM50278248
Synonyms:(1R,S)-1H-Indole-2-carboxylic acid [2-(1-methyl-2-phenyl-ethylcarbamoyl)-phenyl]-amide | CHEMBL469974
TypeSmall organic molecule
Emp. Form.C25H23N3O2
Mol. Mass.397.469
SMILESCC(Cc1ccccc1)NC(=O)c1ccccc1NC(=O)c1cc2ccccc2[nH]1