Reaction Details
TargetCholecystokinin receptor type A
LigandBDBM50278304
Substrate/Competitorn/a
Meas. Tech.ChEMBL_564593 (CHEMBL964033)
IC50 4640±n/a nM
Citation Lassiani, LPavan, MVBerti, FKokotos, GMarkidis, TMennuni, LMakovec, FVarnavas, A Anthranilic acid based CCK1 receptor antagonists: blocking the receptor with the same 'words' of the endogenous ligand. Bioorg Med Chem17:2336-50 (2009) 
 
Cholecystokinin receptor type A
Name:Cholecystokinin receptor type A
Type:Enzyme Catalytic Domain
Mol. Mass.:49676.37
Organism:RAT
Description:Cholecystokinin central 0 RAT::P30551
Residue:444
BDBM50278304
NameBDBM50278304
Synonyms:2-(S)-{2-[(1H-Indole-2-carbonyl)-amino]-benzoylamino}-4-methyl-pentanoic acid | CHEMBL469980
TypeSmall organic molecule
Emp. Form.C22H23N3O4
Mol. Mass.393.4357
SMILESCC(C)C[C@H](NC(=O)N(C(=O)c1cc2ccccc2[nH]1)c1ccccc1)C(O)=O