Reaction Details
TargetCholecystokinin receptor type A
LigandBDBM50278200
Substrate/Competitorn/a
Meas. Tech.ChEMBL_564593 (CHEMBL964033)
IC50 8530±n/a nM
Citation Lassiani, LPavan, MVBerti, FKokotos, GMarkidis, TMennuni, LMakovec, FVarnavas, A Anthranilic acid based CCK1 receptor antagonists: blocking the receptor with the same 'words' of the endogenous ligand. Bioorg Med Chem17:2336-50 (2009) 
 
Cholecystokinin receptor type A
Name:Cholecystokinin receptor type A
Type:Enzyme Catalytic Domain
Mol. Mass.:49676.37
Organism:RAT
Description:Cholecystokinin central 0 RAT::P30551
Residue:444
BDBM50278200
NameBDBM50278200
Synonyms:(1R,S)-1H-Indole-2-carboxylic acid [2-(1-carbamoyl-2-phenyl-ethylcarbamoyl)-phenyl]-amide | CHEMBL471465
TypeSmall organic molecule
Emp. Form.C25H22N4O3
Mol. Mass.426.4672
SMILESNC(=O)C(Cc1ccccc1)NC(=O)c1ccccc1NC(=O)c1cc2ccccc2[nH]1