Reaction Details
TargetOxysterols receptor LXR-beta
LigandBDBM20164
Substrate/Competitorn/a
Meas. Tech.ChEMBL_566456 (CHEMBL958323)
EC50 400±n/a nM
Citation Swahn, BMMacsari, IViklund, JOhberg, LSjödin, JNeelissen, JLindquist, J Liver X receptor agonists with selectivity for LXRbeta; N-aryl-3,3,3-trifluoro-2-hydroxy-2-methylpropionamides. Bioorg Med Chem Lett19:2009-12 (2009) 
 
Oxysterols receptor LXR-beta
Name:Oxysterols receptor LXR-beta
Type:Enzyme Catalytic Domain
Mol. Mass.:50978.79
Organism:Homo sapiens (Human)
Description:P55055
Residue:460
BDBM20164
NameBDBM20164
Synonyms:(1S,2R,5S,10S,11S,14R,15R)-14-[(2R)-4-[(2S)-3,3-dimethyloxiran-2-yl]butan-2-yl]-2,15-dimethyltetracyclo[8.7.0.0^{2,7}.0^{11,15}]heptadec-7-en-5-ol CHEMBL434302 | Epoxycholesterol
TypeSteroid
Emp. Form.C27H44O2
Mol. Mass.400.6371
SMILES[H][C@@]1(CC[C@@H](C)[C@@]2([H])CC[C@@]3([H])[C@]4([H])CC=C5C[C@@]([H])(O)CC[C@]5(C)[C@@]4([H])CC[C@]23C)OC1(C)C