Reaction Details
TargetPhospholipase D2
LigandBDBM50258131
Substrate/Competitorn/a
Meas. Tech.ChEMBL_566796 (CHEMBL957605)
IC50 97±n/a nM
Citation Lewis, JAScott, SALavieri, RBuck, JRSelvy, PEStoops, SLArmstrong, MDBrown, HALindsley, CW Design and synthesis of isoform-selective phospholipase D (PLD) inhibitors. Part I: Impact of alternative halogenated privileged structures for PLD1 specificity. Bioorg Med Chem Lett19:1916-20 (2009) 
 
Phospholipase D2
Name:Phospholipase D2
Type:Protein
Mol. Mass.:106002.47
Organism:Homo sapiens (Human)
Description:n/a
Residue:933
BDBM50258131
NameBDBM50258131
Synonyms:CHEMBL492561 cid_44573690
TypeSmall organic molecule
Emp. Form.C21H22BrClN4O2
Mol. Mass.477.782
SMILESClc1ccc(cc1)C(=O)NCCN1CCC(CC1)n1c2ccc(Br)cc2[nH]c1=O