Reaction Details
TargetPhospholipase D1
LigandBDBM50258131
Substrate/Competitorn/a
Meas. Tech.ChEMBL_566795 (CHEMBL957604)
IC50 3±n/a nM
Citation Lewis, JAScott, SALavieri, RBuck, JRSelvy, PEStoops, SLArmstrong, MDBrown, HALindsley, CW Design and synthesis of isoform-selective phospholipase D (PLD) inhibitors. Part I: Impact of alternative halogenated privileged structures for PLD1 specificity. Bioorg Med Chem Lett19:1916-20 (2009) 
 
Phospholipase D1
Name:Phospholipase D1
Type:Protein
Mol. Mass.:124219.92
Organism:Homo sapiens (Human)
Description:Q13393
Residue:1074
BDBM50258131
NameBDBM50258131
Synonyms:CHEMBL492561 cid_44573690
TypeSmall organic molecule
Emp. Form.C21H22BrClN4O2
Mol. Mass.477.782
SMILESClc1ccc(cc1)C(=O)NCCN1CCC(CC1)n1c2ccc(Br)cc2[nH]c1=O