Reaction Details
TargetPotassium voltage-gated channel subfamily H member 2
LigandBDBM50257621
Substrate/Competitorn/a
Meas. Tech.ChEMBL_567057 (CHEMBL1030736)
Ki 2900±n/a nM
Citation Fish, PVBrown, ADEvrard, ERoberts, LR 7-Sulfonamido-3-benzazepines as potent and selective 5-HT2C receptor agonists: hit-to-lead optimization. Bioorg Med Chem Lett19:1871-5 (2009) 
 
Potassium voltage-gated channel subfamily H member 2
Name:Potassium voltage-gated channel subfamily H member 2
Type:Multi-pass membrane protein
Mol. Mass.:126672.65
Organism:Homo sapiens (Human)
Description:Q12809
Residue:1159
BDBM50257621
NameBDBM50257621
Synonyms:7-(4-(2-chlorophenoxy)piperidin-1-ylsulfonyl)-2,3,4,5-tetrahydro-1H-benzo[d]azepine | CHEMBL492301
TypeSmall organic molecule
Emp. Form.C21H25ClN2O3S
Mol. Mass.420.953
SMILESClc1ccccc1OC1CCN(CC1)S(=O)(=O)c1ccc2CCNCCc2c1