Reaction Details
TargetPotassium voltage-gated channel subfamily H member 2
LigandBDBM50257624
Substrate/Competitorn/a
Meas. Tech.ChEMBL_567057 (CHEMBL1030736)
Ki>7200±n/a nM
Citation Fish, PVBrown, ADEvrard, ERoberts, LR 7-Sulfonamido-3-benzazepines as potent and selective 5-HT2C receptor agonists: hit-to-lead optimization. Bioorg Med Chem Lett19:1871-5 (2009) 
 
Potassium voltage-gated channel subfamily H member 2
Name:Potassium voltage-gated channel subfamily H member 2
Type:Multi-pass membrane protein
Mol. Mass.:126672.65
Organism:Homo sapiens (Human)
Description:Q12809
Residue:1159
BDBM50257624
NameBDBM50257624
Synonyms:7-(phenylsulfonyl)-2,3,4,5-tetrahydro-1H-benzo[d]azepine | CHEMBL521805
TypeSmall organic molecule
Emp. Form.C16H17NO2S
Mol. Mass.287.377
SMILESO=S(=O)(c1ccccc1)c1ccc2CCNCCc2c1