Reaction Details
Target5-hydroxytryptamine receptor 2C
LigandBDBM50257621
Substrate/Competitorn/a
Meas. Tech.ChEMBL_567049 (CHEMBL1029957)
Ki 13±n/a nM
Citation Fish, PVBrown, ADEvrard, ERoberts, LR 7-Sulfonamido-3-benzazepines as potent and selective 5-HT2C receptor agonists: hit-to-lead optimization. Bioorg Med Chem Lett19:1871-5 (2009) 
 
5-hydroxytryptamine receptor 2C
Name:5-hydroxytryptamine receptor 2C
Type:G Protein-Coupled Receptor (GPCR)
Mol. Mass.:51836.79
Organism:Homo sapiens (Human)
Description:P28335
Residue:458
BDBM50257621
NameBDBM50257621
Synonyms:7-(4-(2-chlorophenoxy)piperidin-1-ylsulfonyl)-2,3,4,5-tetrahydro-1H-benzo[d]azepine | CHEMBL492301
TypeSmall organic molecule
Emp. Form.C21H25ClN2O3S
Mol. Mass.420.953
SMILESClc1ccccc1OC1CCN(CC1)S(=O)(=O)c1ccc2CCNCCc2c1